{"text_format":"1","workbook":"xlsx","n_sheets":5,"sheets":["Конфігурація","Calculation","Belegung","легенда","Texts"],"not_rendered":{"charts":0,"images":4,"macros":1,"external_links":0,"defined_names":0,"comments":1,"pivot_tables":0},"unopened":[],"bounds":{"document_bytes":16777216,"sheet_cells":100000,"rows_first":2000,"rows_last":500,"rows_between":2000,"halvings":0,"cell_chars":16384,"cell_head_chars":4096},"cells_cut":0,"cells_raw":0,"read":"whole","date_system":"1900"}

{"sheet":"Конфігурація","index":0,"n_rows":46,"n_cols":16,"rows_kept":46,"cut":false,"hidden":false,"merged":[[1,7,1,8],[1,0,1,5],[12,0,12,5],[17,0,17,5],[3,0,3,1],[3,3,3,4],[5,0,5,1],[5,3,5,4],[9,0,9,1],[9,3,9,4],[10,3,10,4],[10,0,10,1],[14,0,14,1],[7,0,7,5],[14,3,14,4],[15,3,15,4],[15,0,15,1],[17,14,17,19],[29,14,29,19],[29,0,29,5],[19,3,19,4],[21,3,21,4],[21,0,21,1],[19,0,19,1],[28,3,28,4],[23,0,23,1],[1,11,3,19],[45,0,50,5],[43,15,43,21],[23,3,23,4],[25,0,25,1],[25,3,25,4],[27,0,27,1],[27,3,27,4],[33,0,33,1],[31,0,31,1],[33,3,33,4],[31,3,31,4],[35,0,35,1],[35,3,35,4],[37,0,37,3],[43,7,43,13]]}
[]
[{"$f":"IF(Texts!A41<>0,Texts!A41,Texts!#REF!)","v":"Теплогенератор eBUS"},null,null,null,null,null,null,{"$f":"IF(Texts!A5<>0,Texts!A5&\":\",Texts!#REF!&\":\")","v":"Мова:"},null,"Українська",{"$f":"IF(Texts!A103<>0,Texts!A103,Texts!#REF!)","v":"Конфігурація"}]
[]
[{"$f":"IF(AND(Calculation!A3=FALSE,Calculation!A5=FALSE,Calculation!A7=FALSE),Calculation!B1,\"-\")","v":"Звичайний теплогенератор"},null,null,{"$f":"IF(AND(Calculation!A1=FALSE,Calculation!A5=FALSE,Calculation!A7=FALSE),Calculation!B3,\"-\")","v":"geoTHERM 3 кВт"},null,null,null,null,null,null,{"$f":"IF(Texts!A104<>0,Texts!A104,Texts!#REF!)","v":"легенда"}]
[]
[{"$f":"IF(AND(Calculation!A1=FALSE,Calculation!A3=FALSE,Calculation!A7=FALSE),Calculation!B5,\"-\")","v":"Тепловий насос (див. коментар)"},null,null,{"$f":"IF(AND(Calculation!A1=FALSE,Calculation!A3=FALSE,Calculation!A5=FALSE),Calculation!B7,\"-\")","v":"Моноблок aroTHERM"},null,null,null,{"$f":"IF(Texts!A98<>0,Texts!A98,Texts!#REF!)","v":"Розташування підключень VR 71"},null,null,null,null,null,null,null,{"$f":"IF(Texts!A99<>0,Texts!A99,Texts!#REF!)","v":"Розташування підключень VR 70, адреса 1"}]
[]
[{"$f":"IF(Texts!A47<>0,Texts!A47,Texts!#REF!)","v":"Конфігурація системи"}]
[]
[{"$f":"IF(AND(Calculation!A5=TRUE,Calculation!G3=FALSE),Calculation!H1,IF(AND(Calculation!A7=TRUE,Calculation!G3=FALSE),Calculation!H1,IF(AND(Calculation!A3=TRUE,Calculation!D19=FALSE,Calculation!D21=FALSE,Calculation!G3=FALSE),Calculation!H1,\"-\")))","v":"-"},null,null,{"$f":"IF(AND(Calculation!A5=TRUE,Calculation!G1=FALSE,Calculation!H1),Calculation!H3,IF(OR(AND(Calculation!A7=TRUE,Calculation!G1=FALSE),AND(Calculation!A7=TRUE,Calculation!G1=FALSE,Calculation!G7=TRUE),AND(Calculation!A3=TRUE,Calculation!G1=FALSE,Calculation!D19=FALSE,Calculation!D21=FALSE)),Calculation!H3,\"-\"))","v":"-"}]
{"$rows_left_out":37}
{"sheet":"Calculation","index":1,"n_rows":63,"n_cols":21,"rows_kept":63,"cut":false,"hidden":true,"merged":[]}
[false,{"$f":"IF(Texts!A42<>0,Texts!A42,Texts!#REF!)","v":"Звичайний теплогенератор"},null,false,{"$f":"IF(Texts!A57<>0,Texts!A57,Texts!#REF!)","v":"лише з теплогенератором"},null,false,{"$f":"IF(Texts!A48<>0,Texts!A48,Texts!#REF!)","v":"Гібридна система"},null,null,{"$f":"IF(Texts!A84<>0,Texts!A84,Texts!#REF!)","v":"Схема системи"},{"$f":"IF(AND(Calculation!A1=TRUE,OR(Calculation!D1=TRUE,Calculation!D3=TRUE,Calculation!A31=TRUE,Calculation!A27=TRUE)),\"1\",IF(AND(Calculation!A1=TRUE,Calculation!D7=TRUE,Calculation!A31=FALSE,Calculation!A27=FALSE),\"2\",IF(AND(Calculation!A5=TRUE,Calculation!D7=TRUE,Calculation!G3=TRUE,Calculation!D7=TRUE),\"8\",IF(AND(Calculation!A23=TRUE,Calculation!G1=TRUE,Calculation!A5=TRUE,Calculation!D3=FALSE),\"8\",IF(AND(Calculation!A5=TRUE,Calculation!G1=FALSE,Calculation!D7=FALSE,Calculation!G3=TRUE),\"8\",IF(AND(OR(Calculation!A3=TRUE,Calculation!A5=TRUE,Calculation!A7=TRUE),Calculation!G1=TRUE,Calculation!G7=FALSE,Calculation!D1=TRUE,Calculation!A23=TRUE,Calculation!D3=FALSE),\"8\",IF(AND(OR(Calculation!A3=TRUE,Calculation!A7=TRUE),Calculation!G1=FALSE,Calculation!G7=FALSE,Calculation!G3=TRUE,Calculation!D7=TRUE),\"8\",IF(AND(OR(Calculation!A3=TRUE,Calculation!A5=TRUE,Calculation!A7=TRUE),Calculation!G1=TRUE,Calculation!G7=FALSE,Calculation!D3=FALSE,Calculation!D1=TRUE,Calculation!A23=FALSE),\"9\",IF(AND(Calculation!A7=TRUE,Calculation!G3=TRUE,Calculation!D7=FALSE,Calculation!D1=TRUE),\"10\",IF(AND(Calculation!A7=TRUE,Calculation!G1=TRUE,Calculation!G7=TRUE,Calculation!D1=TRUE,Calculation!D3=FALSE),\"10\",IF(AND(OR(Calculation!A27=TRUE),Calculation!A7=TRUE,Calculation!G7=TRUE,Calculation!D7=TRUE,Calculation!G1=FALSE),\"16\",IF(AND(OR(Calculation!A25=TRUE,Calculation!A39=TRUE),Calculation!A7=TRUE,Calculation!G7=TRUE,Calculation!D7=TRUE,Calculation!G1=FALSE,Calculation!A31=TRUE),\"11\",IF(AND(Calculation!A7=TRUE,Calculation!G7=TRUE,Calculation!D7=TRUE,Calculation!G1=FALSE,Calculation!A57=FALSE),\"11\",IF(AND(Calculation!A7=TRUE,Calculation!G7=TRUE,Calculation!D7=TRUE,Calculation!G1=FALSE,Calculation!A57=TRUE),\"11/16\",IF(AND(OR(Calculation!A5=TRUE,Calculation!A7=TRUE),Calculation!G1=TRUE,Calculation!D3=TRUE,Calculation!G7=FALSE,Calculation!A27=FALSE,Calculation!D7=FALSE),\"12\",IF(AND(Calculation!A7=TRUE,Calculation!G7=TRUE,Calculation!D3=TRUE,Calculation!A27=FALSE,Calculation!D1=TRUE),\"13\",IF(AND(OR(Calculation!A5=TRUE,Calculation!A7=TRUE,Calculation!A27=TRUE),Calculation!G1=TRUE,Calculation!D3=TRUE,Calculation!D7=TRUE,Calculation!G7=FALSE),\"16\",IF(AND(Calculation!A7=TRUE,Calculation!G7=TRUE,Calculation!D7=TRUE,Calculation!D3=TRUE),\"16\",\"-\"))))))))))))))))))","v":"-"}]
[]
[false,{"$f":"IF(Texts!A43<>0,Texts!A43,Texts!#REF!)","v":"geoTHERM 3 кВт"},null,false,{"$f":"IF(Texts!A61<>0,Texts!A61,Texts!#REF!)","v":"з тепловим насосом і опалювальним приладом"},null,false,{"$f":"IF(Texts!A49<>0,Texts!A49,Texts!#REF!)","v":"Моноенергетична система"},null,null,{"$f":"IF(Texts!A85<>0,Texts!A85,Texts!#REF!)","v":"Конфігурація VR 70"},{"$f":"IF(AND(Calculation!A57=TRUE,Calculation!A23=TRUE),Calculation!K21,IF(AND(Calculation!A57=TRUE,Calculation!A25=TRUE),\"1\",IF(OR(Calculation!A45=TRUE,Calculation!A47=TRUE),Calculation!M21,IF(OR(Calculation!A49=TRUE,Calculation!A51=TRUE),Calculation!N21,IF(OR(Calculation!A53=TRUE,Calculation!A55=TRUE),Calculation!O21,Calculation!K21)))))","v":"без VR 70"}]
[]
[false,{"$f":"IF(Texts!A44<>0,Texts!A44,Texts!#REF!)","v":"Тепловий насос (див. коментар)"},null,null,{"$f":"IF(Texts!A54<>0,Texts!A54,Texts!#REF!)","v":"Регулювання через теплогенератор"},null,null,null,null,null,{"$f":"IF(Texts!A91<>0,Texts!A91,Texts!#REF!)","v":"Конфігурація VR 71"},{"$f":"IF(AND(OR(Calculation!A31=TRUE,Calculation!A33),OR(Calculation!A23,Calculation!A25,Calculation!A29,Calculation!A39,Calculation!A45,Calculation!A47,Calculation!A49,Calculation!A51,Calculation!A53,Calculation!A55)*AND(Calculation!A37=TRUE)),\"1\",IF(AND(OR(Calculation!A31=TRUE,Calculation!A33),OR(Calculation!A23,Calculation!A25,Calculation!A29,Calculation!A31,Calculation!A33,Calculation!A39,Calculation!A45,Calculation!A47,Calculation!A49,Calculation!A51,Calculation!A53,Calculation!A55)),\"2\",IF(AND(Calculation!A27=TRUE,OR(Calculation!A23,Calculation!A25,Calculation!A29,Calculation!A39,Calculation!A45,Calculation!A47,Calculation!A49,Calculation!A51,Calculation!A53,Calculation!A55,Calculation!A35,Calculation!A37)),\"6\",IF(AND(Calculation!A57=TRUE,Calculation!A23=FALSE,Calculation!A25=FALSE,OR(Calculation!A29,Calculation!A39,Calculation!A45,Calculation!A47,Calculation!A49,Calculation!A51,Calculation!A53,Calculation!A55,Calculation!A57)),\"3\",Calculation!K37))))","v":"без VR 71"}]
[]
[false,{"$f":"IF(Texts!A45<>0,Texts!A45,Texts!#REF!)","v":"Моноблок aroTHERM"},null,false,{"$f":"IF(Texts!A55<>0,Texts!A55,Texts!#REF!)","v":"Регулювання через VRC 720"},null,false,{"$f":"IF(Texts!A50<>0,Texts!A50,Texts!#REF!)","v":"Розділення системи з модулем WT"},null,null,{"$f":"IF(Texts!A52<>0,Texts!A52,Texts!#REF!)","v":"Приготування гарячої води"},null,null,{"$f":"IF(Texts!A63<>0,Texts!A63,Texts!#REF!)","v":"Кількість опалювальних контурів"}]
[]
[null,null,null,null,{"$f":"IF(Texts!A59<>0,Texts!A59,Texts!#REF!)","v":"лише з додатковим опалювальним приладом"},null,null,null,null,null,{"$f":"IF(Texts!A47<>0,Texts!A47,Texts!#REF!)","v":"Конфігурація системи"},null,null,{"$f":"IF(Texts!A75<>0,Texts!A75,Texts!#REF!)","v":"Спеціальне обладнання"}]
[]
{"$rows_left_out":54}
{"sheet":"Belegung","index":2,"n_rows":29,"n_cols":15,"rows_kept":29,"cut":false,"hidden":true,"merged":[[0,8,0,14],[20,0,20,6],[0,0,0,6],[10,0,10,6]]}
[{"$f":"Calculation!I21","v":"Розташування підключень VR 70, адреса 1"},null,null,null,null,null,null,null,{"$f":"Calculation!I37","v":"Розташування підключень VR 71"}]
[]
["R1",null,{"$f":"IF(ISERROR(OR(Конфігурація!D42=\"1\")),\"-\",IF(OR(Конфігурація!D42=\"1\"),VLOOKUP(A3,Calculation!$I$24:$UY$35,VALUE(Calculation!L$3)+1,TRUE),IF(OR(Конфігурація!D42=\"1 x VR 70\",Конфігурація!D42=\"2 x VR 70\",Конфігурація!D42=\"3 x VR 70\"),Calculation!P24,\"-\")))","v":"-"},null,"S1",null,{"$f":"IF(ISERROR(OR(Конфігурація!D42=\"1\")),\"-\",IF(OR(Конфігурація!D42=\"1\"),VLOOKUP(E3,Calculation!$I$24:$UY$35,VALUE(Calculation!L$3)+1,TRUE),IF(OR(Конфігурація!D42=\"1 x VR 70\",Конфігурація!D42=\"2 x VR 70\",Конфігурація!D42=\"3 x VR 70\"),\"-\",\"-\")))","v":"-"},null,"R01",null,{"$f":"IF(ISERROR(VLOOKUP(I3,Calculation!$I$40:$T$78,VALUE(Конфігурація!D44)+1,TRUE)),\"-\",VLOOKUP(I3,Calculation!$I$40:$T$78,VALUE(Конфігурація!D44)+1,TRUE))","v":"-"},null,"S01",null,{"$f":"IF(ISERROR(VLOOKUP(M3,Calculation!$I$40:$T$78,VALUE(Конфігурація!D44)+1,TRUE)),\"-\",VLOOKUP(M3,Calculation!$I$40:$T$78,VALUE(Конфігурація!D44)+1,TRUE))","v":"-"}]
["R2",null,{"$f":"IF(ISERROR(OR(Конфігурація!D42=\"1\")),\"-\",IF(OR(Конфігурація!D42=\"1\"),VLOOKUP(A4,Calculation!$I$24:$UY$35,VALUE(Calculation!L$3)+1,TRUE),IF(OR(Конфігурація!D42=\"1 x VR 70\",Конфігурація!D42=\"2 x VR 70\",Конфігурація!D42=\"3 x VR 70\"),Calculation!P25,\"-\")))","v":"-"},null,"S2",null,{"$f":"IF(ISERROR(OR(Конфігурація!D42=\"1\")),\"-\",IF(OR(Конфігурація!D42=\"1\"),VLOOKUP(E4,Calculation!$I$24:$UY$35,VALUE(Calculation!L$3)+1,TRUE),IF(OR(Конфігурація!D42=\"1 x VR 70\",Конфігурація!D42=\"2 x VR 70\",Конфігурація!D42=\"3 x VR 70\"),Calculation!P30,\"-\")))","v":"-"},null,"R02",null,{"$f":"IF(ISERROR(VLOOKUP(I4,Calculation!$I$40:$T$78,VALUE(Конфігурація!D44)+1,TRUE)),\"-\",VLOOKUP(I4,Calculation!$I$40:$T$78,VALUE(Конфігурація!D44)+1,TRUE))","v":"-"},null,"S02",null,{"$f":"IF(ISERROR(VLOOKUP(M4,Calculation!$I$40:$T$78,VALUE(Конфігурація!D44)+1,TRUE)),\"-\",VLOOKUP(M4,Calculation!$I$40:$T$78,VALUE(Конфігурація!D44)+1,TRUE))","v":"-"}]
["R3/R4",null,{"$f":"IF(ISERROR(OR(Конфігурація!D42=\"1\")),\"-\",IF(OR(Конфігурація!D42=\"1\"),VLOOKUP(A5,Calculation!$I$24:$UY$35,VALUE(Calculation!L$3)+1,TRUE),IF(OR(Конфігурація!D42=\"1 x VR 70\",Конфігурація!D42=\"2 x VR 70\",Конфігурація!D42=\"3 x VR 70\"),Calculation!P26,\"-\")))","v":"-"},null,"S3",null,{"$f":"IF(ISERROR(OR(Конфігурація!D42=\"1\")),\"-\",IF(OR(Конфігурація!D42=\"1\"),VLOOKUP(E5,Calculation!$I$24:$UY$35,VALUE(Calculation!L$3)+1,TRUE),IF(OR(Конфігурація!D42=\"1 x VR 70\",Конфігурація!D42=\"2 x VR 70\",Конфігурація!D42=\"3 x VR 70\"),Calculation!P31,\"-\")))","v":"-"},null,"R03",null,{"$f":"IF(ISERROR(VLOOKUP(I5,Calculation!$I$40:$T$78,VALUE(Конфігурація!D44)+1,TRUE)),\"-\",VLOOKUP(I5,Calculation!$I$40:$T$78,VALUE(Конфігурація!D44)+1,TRUE))","v":"-"},null,"S03",null,{"$f":"IF(ISERROR(VLOOKUP(M5,Calculation!$I$40:$T$78,VALUE(Конфігурація!D44)+1,TRUE)),\"-\",VLOOKUP(M5,Calculation!$I$40:$T$78,VALUE(Конфігурація!D44)+1,TRUE))","v":"-"}]
["R5/R6",null,{"$f":"IF(ISERROR(OR(Конфігурація!D42=\"1\")),\"-\",IF(OR(Конфігурація!D42=\"1\"),VLOOKUP(A6,Calculation!$I$24:$UY$35,VALUE(Calculation!L$3)+1,TRUE),IF(OR(Конфігурація!D42=\"1 x VR 70\",Конфігурація!D42=\"2 x VR 70\",Конфігурація!D42=\"3 x VR 70\"),Calculation!P27,\"-\")))","v":"-"},null,"S4",null,{"$f":"IF(ISERROR(OR(Конфігурація!D42=\"1\")),\"-\",IF(OR(Конфігурація!D42=\"1\"),VLOOKUP(E6,Calculation!$I$24:$UY$35,VALUE(Calculation!L$3)+1,TRUE),IF(OR(Конфігурація!D42=\"1 x VR 70\",Конфігурація!D42=\"2 x VR 70\",Конфігурація!D42=\"3 x VR 70\"),Calculation!P32,\"-\")))","v":"-"},null,"R04",null,{"$f":"IF(ISERROR(VLOOKUP(I6,Calculation!$I$40:$T$78,VALUE(Конфігурація!D44)+1,TRUE)),\"-\",VLOOKUP(I6,Calculation!$I$40:$T$78,VALUE(Конфігурація!D44)+1,TRUE))","v":"-"},null,"S04",null,{"$f":"IF(ISERROR(VLOOKUP(M6,Calculation!$I$40:$T$78,VALUE(Конфігурація!D44)+1,TRUE)),\"-\",VLOOKUP(M6,Calculation!$I$40:$T$78,VALUE(Конфігурація!D44)+1,TRUE))","v":"-"}]
[null,null,null,null,"S5",null,{"$f":"IF(ISERROR(OR(Конфігурація!D42=\"1\")),\"-\",IF(OR(Конфігурація!D42=\"1\"),VLOOKUP(E7,Calculation!$I$24:$UY$35,VALUE(Calculation!L$3)+1,TRUE),IF(OR(Конфігурація!D42=\"1 x VR 70\",Конфігурація!D42=\"2 x VR 70\",Конфігурація!D42=\"3 x VR 70\"),Calculation!P33,\"-\")))","v":"-"},null,"R05",null,{"$f":"IF(ISERROR(VLOOKUP(I7,Calculation!$I$40:$T$78,VALUE(Конфігурація!D44)+1,TRUE)),\"-\",VLOOKUP(I7,Calculation!$I$40:$T$78,VALUE(Конфігурація!D44)+1,TRUE))","v":"-"},null,"S05",null,{"$f":"IF(ISERROR(VLOOKUP(M7,Calculation!$I$40:$T$78,VALUE(Конфігурація!D44)+1,TRUE)),\"-\",VLOOKUP(M7,Calculation!$I$40:$T$78,VALUE(Конфігурація!D44)+1,TRUE))","v":"-"}]
[null,null,null,null,"S6",null,{"$f":"IF(ISERROR(OR(Конфігурація!D42=\"1\")),\"-\",IF(OR(Конфігурація!D42=\"1\"),VLOOKUP(E8,Calculation!$I$24:$UY$35,VALUE(Calculation!L$3)+1,TRUE),IF(OR(Конфігурація!D42=\"1 x VR 70\",Конфігурація!D42=\"2 x VR 70\",Конфігурація!D42=\"3 x VR 70\"),Calculation!P34,\"-\")))","v":"-"},null,"R06",null,{"$f":"IF(ISERROR(VLOOKUP(I8,Calculation!$I$40:$T$78,VALUE(Конфігурація!D44)+1,TRUE)),\"-\",VLOOKUP(I8,Calculation!$I$40:$T$78,VALUE(Конфігурація!D44)+1,TRUE))","v":"-"},null,"S06",null,{"$f":"IF(ISERROR(VLOOKUP(M8,Calculation!$I$40:$T$78,VALUE(Конфігурація!D44)+1,TRUE)),\"-\",VLOOKUP(M8,Calculation!$I$40:$T$78,VALUE(Конфігурація!D44)+1,TRUE))","v":"-"}]
[null,null,null,null,"S7",null,{"$f":"IF(ISERROR(OR(Конфігурація!D42=\"1\")),\"-\",IF(OR(Конфігурація!D42=\"1\"),VLOOKUP(E9,Calculation!$I$24:$UY$35,VALUE(Calculation!L$3)+1,TRUE),IF(OR(Конфігурація!D42=\"1 x VR 70\",Конфігурація!D42=\"2 x VR 70\",Конфігурація!D42=\"3 x VR 70\"),Calculation!P35,\"-\")))","v":"-"},null,"R07/08",null,{"$f":"IF(ISERROR(VLOOKUP(I9,Calculation!$I$40:$T$78,VALUE(Конфігурація!D44)+1,TRUE)),\"-\",VLOOKUP(I9,Calculation!$I$40:$T$78,VALUE(Конфігурація!D44)+1,TRUE))","v":"-"},null,"S07",null,{"$f":"IF(ISERROR(VLOOKUP(M9,Calculation!$I$40:$T$78,VALUE(Конфігурація!D44)+1,TRUE)),\"-\",VLOOKUP(M9,Calculation!$I$40:$T$78,VALUE(Конфігурація!D44)+1,TRUE))","v":"-"}]
[null,null,null,null,null,null,null,null,"R09/10",null,{"$f":"IF(ISERROR(VLOOKUP(I10,Calculation!$I$40:$T$78,VALUE(Конфігурація!D44)+1,TRUE)),\"-\",VLOOKUP(I10,Calculation!$I$40:$T$78,VALUE(Конфігурація!D44)+1,TRUE))","v":"-"},null,"S08",null,{"$f":"IF(ISERROR(VLOOKUP(M10,Calculation!$I$40:$T$78,VALUE(Конфігурація!D44)+1,TRUE)),\"-\",VLOOKUP(M10,Calculation!$I$40:$T$78,VALUE(Конфігурація!D44)+1,TRUE))","v":"-"}]
{"$rows_left_out":20}
{"sheet":"легенда","index":3,"n_rows":16,"n_cols":5,"rows_kept":16,"cut":false,"hidden":true,"merged":[[5,0,5,1],[13,0,13,1],[4,3,4,4]]}
["HCxP",{"$f":"IF(Texts!A6<>0,Texts!A6,Texts!#REF!)","v":"Опалювальний насос для опалювального контуру х"},null,"BufTopDHW",{"$f":"IF(Texts!A23<>0,Texts!A23,Texts!#REF!)","v":"Датчик температури накопичувача вгорі для відсіку гарячої води буферної ємності allSTOR"}]
["HCxcl",{"$f":"IF(Texts!A7<>0,Texts!A7,Texts!#REF!)","v":"Закривання змішувальних клапанів для опалювального контуру x"},null,"BufBtDHW",{"$f":"IF(Texts!A24<>0,Texts!A24,Texts!#REF!)","v":"Датчик температури накопичувача внизу для відсіку гарячої води буферної ємності allSTOR"}]
["HCxop",{"$f":"IF(Texts!A8<>0,Texts!A8,Texts!#REF!)","v":"Відкривання змішувальних клапанів для опалювального контуру x"},null,"BufTopCH",{"$f":"IF(Texts!A25<>0,Texts!A25,Texts!#REF!)","v":"Датчик температури накопичувача вгорі для відсіку опалення буферної ємності allSTOR"}]
["DEMx",{"$f":"IF(Texts!A9<>0,Texts!A9,Texts!#REF!)","v":"Зовнішнє вимкнення опалення для опалювального контуру x"},null,"BufBtCH",{"$f":"IF(Texts!A26<>0,Texts!A26,Texts!#REF!)","v":"Датчик температури накопичувача внизу для відсіку опалення буферної ємності allSTOR"}]
["FSx",{"$f":"IF(Texts!A10<>0,Texts!A10,Texts!#REF!)","v":"Датчик температури лінії подачі для опалювального контуру x"}]
[null,null,null,"TD1",{"$f":"IF(Texts!A28<>0,Texts!A28,Texts!#REF!)","v":"Перший датчик температури для ΔT-регулювання"}]
["SysFlow",{"$f":"IF(Texts!A12<>0,Texts!A12,Texts!#REF!)","v":"Температура лінії подачі систем (гідророзподільник)"},null,"TD2",{"$f":"IF(Texts!A29<>0,Texts!A29,Texts!#REF!)","v":"Другий датчик температури для ΔT-регулювання"}]
[]
["DHW1",{"$f":"IF(Texts!A14<>0,Texts!A14,Texts!#REF!)","v":"Температурний датчик накопичувача"},null,"COLP1",{"$f":"IF(Texts!A32<>0,Texts!A32,Texts!#REF!)","v":"Геліонасос для колекторного поля 1"}]
["DHWTop",{"$f":"IF(Texts!A15<>0,Texts!A15,Texts!#REF!)","v":"Датчик температури накопичувача вгорі для накопичувача ГВ"},null,"COL1",{"$f":"IF(Texts!A33<>0,Texts!A33,Texts!#REF!)","v":"Датчик температури для колекторного поля 1"}]
{"$rows_left_out":7}
{"sheet":"Texts","index":4,"n_rows":104,"n_cols":34,"rows_kept":104,"cut":false,"hidden":true,"merged":[]}
["Language",{"$f":"Конфігурація!J2","v":"Українська"}]
["Index",{"$f":"MATCH(Конфігурація!J2,$B$4:$AH$4,0)","v":2}]
[]
["Chosen translation","Deutsch","Українська","Français","Italiano","Dansk","Nederlands","Castellano","Türkçe","Magyar","Русский","English","Eesti","Latviski","Lietuvių","Svenska","Norsk","Polski","Čeština","Hrvatski","Slovencina","Română","Slovenski","Srpski","Português","Български","Suomi","Shqip","Македонски","한국어","简体中文","中國傳統的","العربية","Ελληνικά"]
[{"$f":"INDEX($B$5:$AH$101,ROW()-ROW($A$4),$B$2)","v":"Мова"},"Sprache","Мова","Langue","Lingua","Sprog","Taal","Idioma","Dil","Nyelv","Язык","Language","Keel","Valoda","Kalba","Språk","Språk","Język","Jazyk","Jezik","Jazyk","Limba","Jezik","Jezik","Idioma","Език","Kieli","Gjuha","Јазик","언어","语言","語言","اللغة","Γλώσσα"]
["Опалювальний насос для опалювального контуру х","Heizungspumpe für Heizkreis x","Опалювальний насос для опалювального контуру х","Pompe du circuit de chauffage x","Pompa di riscaldamento per circuito di riscaldamento x","Centralvarmepumpe for varmekreds x","CV-pomp voor CV-circuit x","Bomba de calefacción para circuito de calefacción x","Isıtma devresi x için ısıtma devresi pompası","Fűtőköri szivattyú x fűtőkörhöz","Насос системы отопления для отопительного контура x","Heating pump for heating circuit x","Küttepump küttekontuuril x","Apkures kontūra x apkures sūknis","Šildymo kontūro x šildymo sistemos siurblys","Värmepump för värmekrets x","Varmepumpe for varmekrets x","Pompa obiegu grzewczego x","Oběhové čerpadlo topení pro topný okruh x","Crpka za grijanje za toplinski krug x","Tepelné čerpadlo pre vyhrievací okruh x","Pompa de încălzire pentru circuitul de încălzire x","Črpalka sistema ogrevanja za ogrevalni krogotok x","Pumpa za grejanje za grejni krug x","Bomba do aquecimento para circuito de aquecimento x","Отоплителна помпа за отоплителен кръг x","Lämmityspiirin x lämpöjohtopumppu","Pompa e ngrohjes për qarkun e ngrohjes x","Грејна пумпа за грејно коло x","난방 회로 x용 난방 펌프","供暖回路 x 的供暖泵","加熱迴路 x 加熱幫浦","مضخة التسخين لدورة التسخين x‏","Αντλία θέρμανσης για το κύκλωμα θέρμανσης x"]
["Закривання змішувальних клапанів для опалювального контуру x","Mischer schließen für Heizkreis x","Закривання змішувальних клапанів для опалювального контуру x","Fermeture V3V du circuit de chauffage x","Chiudi miscelatore per circuito di riscaldamento x","Luk mikserventil for varmekreds x","Mengklep sluiten voor CV-circuit x","Cerrar mezclador para circuito de calefacción x","Isıtma devresi x için karıştırıcının kapatılması","Keverőszelep zárása x fűtőkörhöz","Закрывание смесителей для отопительного контура x","Close mixer for heating circuit x","Segisti sulgemine küttekontuuril x","Apkures kontūra x maisītāja aizvēršana","Maišytuvo uždarymas šildymo kontūrui x","Stänga blandningsventil för värmekrets x","Lukk blandere for varmekrets x","Zamknąć zawór mieszacza obiegu grzewczego x","Zavírání směšovacího ventilu pro topný okruh x","Zatvaranje ventila za miješanje za toplinski krug x","Zatvorenie zmiešavača pre vyhrievací okruh x","Închideţi vana de amestec pentru circuitul de încălzire x","Zaprtje mešalnega ventila za ogrevalni krogotok x","Zatvoriti mešač za grejni krug x","Fechar válvula de mistura para circuito de aquecimento x","Затворете смесителния вентил за отоплителен кръг x","Lämmityspiirin x sekoitusventtiilin sulkeminen","Mishelator për qarkun e ngrohjes x","Затворање на мешалка за грејно коло x","난방 회로 x용 믹서 닫기","为供暖回路 x 关闭混合器","關閉加熱迴路 x 混合器","أغلق الخلاط لدورة التسخين x‏","Κλείσιμο αναμικτικής βαλβίδας για το κύκλωμα θέρμανσης x"]
["Відкривання змішувальних клапанів для опалювального контуру x","Mischer öffnen für Heizkreis x","Відкривання змішувальних клапанів для опалювального контуру x","Ouverture V3V du circuit de chauffage x","Apri miscelatore per circuito di riscaldamento x","Åbn mikserventil for varmekreds x","Mengklep openen voor CV-circuit x","Abrir mezclador para circuito de calefacción x","Isıtma devresi x için karıştırıcının açılması","Keverőszelep nyitása x fűtőkörhöz","Открывание смесителей для отопительного контура x","Open mixer for heating circuit x","Segisti avamine küttekontuuril x","Apkures kontūra x maisītāja atvēršana","Maišytuvo atidarymas šildymo kontūrui x","Öppna blandningsventil för värmekrets x","Åpne blandere for varmekrets x","Otworzyć zawór mieszacza obiegu grzewczego x","Otevírání směšovacího ventilu pro topný okruh x","Otvaranje ventila za miješanje za toplinski krug x","Otvorenie zmiešavača pre vyhrievací okruh x","Deschideţi vana de amestec pentru circuitul de încălzire x","Odprtje mešalnega ventila za ogrevalni krogotok x","Otvoriti mešač za grejni krug x","Abrir válvula de mistura para circuito de aquecimento x","Отворете смесителния вентил за отоплителен кръг x","Lämmityspiirin x sekoitusventtiilin avaaminen","Hapni mishelatorin për qarkun e ngrohjes x","Отворање на мешалка за грејно коло x","난방 회로 x용 믹서 열기","为供暖回路 x 打开混合器","開啟加熱迴路 x 混合器","افتح الخلاط لدورة التسخين x‏","Άνοιγμα αναμικτικής βαλβίδας για το κύκλωμα θέρμανσης x"]
["Зовнішнє вимкнення опалення для опалювального контуру x","Externe Heizungsabschaltung für Heizkreis x","Зовнішнє вимкнення опалення для опалювального контуру x","Demande de chauffage externe par contact NF pour circuit chauffage x","Spegnimento esterno del riscaldamento per circuito di riscaldamento x","Ekstern varmefrakobling for varmekreds x","Externe verwarmingsuitschakeling voor CV-circuit x","Desconexión externa de calefacción para circuito de calefacción x","Isıtma devresi x için harici ısıtma sistemi anahtarlama","Külső fűtéslekapcsolás x fűtőkörhöz","Внешнее отключение отопления для отопительного контура x","External heating switch-off for heating circuit x","Väline kütte väljalülitamine küttekontuuril x","Apkures kontūra x ārēja apkures atslēgšana","Išorinis šildymo išjungimas šildymo kontūrui x","Extern värmeavstängning för värmekrets x","Ekstern varmeutkobling for varmekrets x","Zewnętrzny wyłącznik ogrzewania obiegu grzewczego x","Externí vypínání topení pro topný okruh x","Vanjsko isključivanje grijanja za toplinski krug x","Externé vypnutie ohrevu pre vyhrievací okruh x","Deconectarea externă a încălzirii pentru circuitul de încălzire x","Zunanji izklop ogrevanja za ogrevalni krogotok x","Eksterno isključivanje grejanja za grejni krug x","Desligamento externo do aquecimento para circuito de aquecimento x","Външно изключване на отоплението за отоплителен кръг x","Lämmityspiirin x ulkoinen lämmityksen poiskytkentä","Fikja e jashtme e ngrohjes për qarkun e ngrohjes x","Екстерно исклучување на греењето за грејно коло x","난방 회로 x용 외부 난방 차단","供暖回路 x 的外部供暖关闭","加熱迴路 x 外部加熱關閉裝置","تجهيزة إيقاف التسخين الخارجية لدورة التسخين x‏","Εξωτερική απενεργοποίηση θέρμανσης για το κύκλωμα θέρμανσης x"]
["Датчик температури лінії подачі для опалювального контуру x","Vorlauftemperaturfühler für Heizkreis x","Датчик температури лінії подачі для опалювального контуру x","Sonde de température du circuit de chauffage x","Sensore della temperatura di mandata per circuito di riscaldamento x","Fremløbstemperaturføler for varmekreds x","Aanvoertemperatuurvoeler voor CV-circuit x","Sonda de temperatura de ida para circuito de calefacción x","Isıtma devresi x için gidiş devresi sıcaklık sensörü","Előremenő hőmérséklet-érzékelő x fűtőkörhöz","Датчик температуры подающей линии для отопительного контура x","Flow temperature sensor for heating circuit x","Pealevoolu temperatuuriandur küttekontuuril x","Apkures kontūra x turpgaitas temperatūras sensors","Šildymo kontūro x tiekiamojo srauto temperatūros jutiklis","Givare framledningstemperatur för värmekrets x","Turtemperaturføler for varmekrets x","Czujnik temperatury zasilania obiegu grzewczego x","Výstupní teplotní čidlo pro topný okruh x","Osjetnik temperature polaznog voda za toplinski krug x","Tepelné čerpadlo pre vyhrievací okruh x","Senzorul temperaturii pe tur pentru circuitul de încălzire x","Senzor temperature dvižnega voda za ogrevalni krogotok x","Senzor temperature polaznog voda za grejni krug x","Sensor da temperatura de avanço para circuito de aquecimento x","Температурен сензор на подаващия тръбопровод за отоплителен кръг x","Lämmityspiirin x menoveden lämpötila-anturi","Sensori i temperaturës së rrjedhës për qarkun e ngrohjes x","Сензор за температура на напојниот вод за грејно коло x","난방 회로 x용 난방 공급수 온도 센서","供暖回路 x 的供水温度传感器","加熱迴路 x 進流溫度感應器","مستشعر درجة حرارة التغذية لدورة التسخين x‏","Αισθητήρας θερμοκρασίας αγωγού προσαγωγής για το κύκλωμα θέρμανσης x"]
{"$rows_left_out":94}